Reaction Details
TargetNociceptin receptor
LigandBDBM50137562
Substrate/Competitorn/a
Meas. Tech.ChEMBL_146112 (CHEMBL754581)
IC50 200±n/a nM
Citation Kawamoto, HOzaki, SItoh, YMiyaji, MArai, SNakashima, HKato, TOhta, HIwasawa, Y Discovery of the first potent and selective small molecule opioid receptor-like (ORL1) antagonist: 1-[(3R,4R)-1-cyclooctylmethyl-3- hydroxymethyl-4-piperidyl]-3-ethyl-1, 3-dihydro-2H-benzimidazol-2-one (J-113397). J Med Chem42:5061-3 (2000) Nociceptin receptor
Name:Nociceptin receptor
Type:G Protein-Coupled Receptor (GPCR)
Mol. Mass.:40702.87
Organism:Homo sapiens (Human)
Description:P41146
Residue:370
BDBM50137562
NameBDBM50137562
Synonyms:1-(1-Benzyl-piperidin-4-yl)-1,3-dihydro-benzoimidazol-2-one | CHEMBL300616
TypeSmall organic molecule
Emp. Form.C19H21N3O
Mol. Mass.307.3895
SMILESO=c1[nH]c2ccccc2n1C1CCN(Cc2ccccc2)CC1