Reaction Details
TargetNociceptin receptor
LigandBDBM50083232
Substrate/Competitorn/a
Meas. Tech.ChEMBL_146104 (CHEMBL754506)
EC50>10000±n/a nM
Citation Kawamoto, HOzaki, SItoh, YMiyaji, MArai, SNakashima, HKato, TOhta, HIwasawa, Y Discovery of the first potent and selective small molecule opioid receptor-like (ORL1) antagonist: 1-[(3R,4R)-1-cyclooctylmethyl-3- hydroxymethyl-4-piperidyl]-3-ethyl-1, 3-dihydro-2H-benzimidazol-2-one (J-113397). J Med Chem42:5061-3 (2000) Nociceptin receptor
Name:Nociceptin receptor
Type:G Protein-Coupled Receptor (GPCR)
Mol. Mass.:40702.87
Organism:Homo sapiens (Human)
Description:P41146
Residue:370
BDBM50083232
NameBDBM50083232
Synonyms:1-(1-Cyclooctylmethyl-piperidin-4-yl)-3-ethyl-1,3-dihydro-benzoimidazol-2-one | CHEMBL146013
TypeSmall organic molecule
Emp. Form.C23H35N3O
Mol. Mass.369.5435
SMILESCCn1c2ccccc2n(C2CCN(CC3CCCCCCC3)CC2)c1=O