Reaction Details
TargetKappa-type opioid receptor
LigandBDBM50083227
Substrate/Competitorn/a
Meas. Tech.ChEMBL_145107 (CHEMBL751991)
IC50 32±n/a nM
Citation Kawamoto, HOzaki, SItoh, YMiyaji, MArai, SNakashima, HKato, TOhta, HIwasawa, Y Discovery of the first potent and selective small molecule opioid receptor-like (ORL1) antagonist: 1-[(3R,4R)-1-cyclooctylmethyl-3- hydroxymethyl-4-piperidyl]-3-ethyl-1, 3-dihydro-2H-benzimidazol-2-one (J-113397). J Med Chem42:5061-3 (2000) Kappa-type opioid receptor
Name:Kappa-type opioid receptor
Type:G Protein-Coupled Receptor (GPCR)
Mol. Mass.:42648.76
Organism:Homo sapiens (Human)
Description:P41145
Residue:380
BDBM50083227
NameBDBM50083227
Synonyms:1-{1-[1-(2-Chloro-phenyl)-ethyl]-piperidin-4-yl}-1,3-dihydro-benzoimidazol-2-one | CHEMBL146054
TypeSmall organic molecule
Emp. Form.C20H22ClN3O
Mol. Mass.355.861
SMILESCC(N1CCC(CC1)n1c2ccccc2[nH]c1=O)c1ccccc1Cl