Reaction Details
TargetRetinoic acid receptor alpha
LigandBDBM50052414
Substrate/Competitorn/a
Meas. Tech.ChEMBL_197400 (CHEMBL799791)
IC50 41±n/a nM
Citation Kikuchi, KHibi, SYoshimura, HTokuhara, NTai, KHida, TYamauchi, TNagai, M Syntheses and structure-activity relationships of 5,6,7, 8-tetrahydro-5,5,8,8-tetramethyl-2-quinoxaline derivatives with retinoic acid receptor alpha agonistic activity. J Med Chem43:409-19 (2000) Retinoic acid receptor alpha
Name:Retinoic acid receptor alpha
Type:PROTEIN
Mol. Mass.:50778.87
Organism:Homo sapiens (Human)
Description:ChEMBL_1466191
Residue:462
BDBM50052414
NameBDBM50052414
Synonyms:4-(1,1,4,4-tetramethyl-1,2,3,4-tetrahydronaphthalene-7-carboxamido)benzoic acid 4-[(5,5,8,8-Tetramethyl-5,6,7,8-tetrahydro-naphthalene-2-carbonyl)-amino]-benzoic acid CHEMBL69367 | US9963439, AM580
TypeSmall organic molecule
Emp. Form.C22H25NO3
Mol. Mass.351.4388
SMILESCC1(C)CCC(C)(C)c2cc(ccc12)C(=O)Nc1ccc(cc1)C(O)=O