Reaction Details
TargetRetinoic acid receptor alpha
LigandBDBM50084831
Substrate/Competitorn/a
Meas. Tech.ChEMBL_197401 (CHEMBL799792)
IC50 32±n/a nM
Citation Kikuchi, KHibi, SYoshimura, HTokuhara, NTai, KHida, TYamauchi, TNagai, M Syntheses and structure-activity relationships of 5,6,7, 8-tetrahydro-5,5,8,8-tetramethyl-2-quinoxaline derivatives with retinoic acid receptor alpha agonistic activity. J Med Chem43:409-19 (2000) Retinoic acid receptor alpha
Name:Retinoic acid receptor alpha
Type:PROTEIN
Mol. Mass.:50778.87
Organism:Homo sapiens (Human)
Description:ChEMBL_1466191
Residue:462
BDBM50084831
NameBDBM50084831
Synonyms:4-[5-(5,5,8,8-Tetramethyl-5,6,7,8-tetrahydro-quinoxalin-2-yl)-furan-2-yl]-benzoic acid | CHEMBL132033
TypeSmall organic molecule
Emp. Form.C23H24N2O3
Mol. Mass.376.4483
SMILESCC1(C)CCC(C)(C)c2nc(cnc12)-c1ccc(o1)-c1ccc(cc1)C(O)=O