Reaction Details
TargetPeroxisome proliferator-activated receptor gamma
LigandBDBM50085041
Substrate/Competitorn/a
Meas. Tech.ChEMBL_88436 (CHEMBL701905)
EC50 5500±n/a nM
Citation Willson, TMBrown, PJSternbach, DDHenke, BR The PPARs: from orphan receptors to drug discovery. J Med Chem43:527-50 (2000) Peroxisome proliferator-activated receptor gamma
Name:Peroxisome proliferator-activated receptor gamma
Type:Nuclear Receptor
Mol. Mass.:57613.46
Organism:Homo sapiens (Human)
Description:P37231
Residue:505
BDBM50085041
NameBDBM50085041
Synonyms:2-(4-(3-(4-acetyl-3-hydroxy-2-propylphenoxy)propoxy)phenoxy)acetic acid L-165041 {4-[3-(4-Acetyl-3-hydroxy-2-propyl-phenoxy)-propoxy]-phenoxy}-acetic acid(L-165041) | {4-[3-(4-acetyl-3-hydroxy-2-propylphenoxy)propoxy]phenoxy}acetic acid
TypeSmall organic molecule
Emp. Form.C22H26O7
Mol. Mass.402.4376
SMILESCCCc1c(O)c(ccc1OCCCOc1ccc(OCC(O)=O)cc1)C(C)=O