Reaction Details
TargetPeroxisome proliferator-activated receptor delta
LigandBDBM50085040
Substrate/Competitorn/a
Meas. Tech.ChEMBL_139147 (CHEMBL747680)
EC50 23±n/a nM
Citation Willson, TMBrown, PJSternbach, DDHenke, BR The PPARs: from orphan receptors to drug discovery. J Med Chem43:527-50 (2000) Peroxisome proliferator-activated receptor delta
Name:Peroxisome proliferator-activated receptor delta
Type:PROTEIN
Mol. Mass.:49719.14
Organism:Mus musculus
Description:ChEMBL_1288931
Residue:440
BDBM50085040
NameBDBM50085040
Synonyms:CHEMBL278994 {3-Chloro-4-[3-(3-phenyl-7-propyl-benzofuran-6-yloxy)-propylsulfanyl]-phenyl}-acetic acid | {3-Chloro-4-[3-(3-phenyl-7-propyl-benzofuran-6-yloxy)-propylsulfanyl]-phenyl}-acetic acid(L-796449)
TypeSmall organic molecule
Emp. Form.C28H27ClO4S
Mol. Mass.495.03
SMILESCCCc1c(OCCCSc2ccc(CC(O)=O)cc2Cl)ccc2c(coc12)-c1ccccc1