Reaction Details
TargetPeroxisome proliferator-activated receptor gamma
LigandBDBM50075315
Substrate/Competitorn/a
Meas. Tech.ChEMBL_139152 (CHEMBL747685)
EC50 140±n/a nM
Citation Willson, TMBrown, PJSternbach, DDHenke, BR The PPARs: from orphan receptors to drug discovery. J Med Chem43:527-50 (2000) Peroxisome proliferator-activated receptor gamma
Name:Peroxisome proliferator-activated receptor gamma
Type:PROTEIN
Mol. Mass.:57593.55
Organism:Mus musculus
Description:ChEMBL_1453700
Residue:505
BDBM50075315
NameBDBM50075315
Synonyms:5-(2,4-Dioxo-thiazolidin-5-ylmethyl)-2-methoxy-N-(4-trifluoromethyl-benzyl)-benzamide CHEMBL24458 | KRP-297
TypeSmall organic molecule
Emp. Form.C20H17F3N2O4S
Mol. Mass.438.42
SMILESCOc1ccc(Cc2sc(=O)[nH]c2O)cc1C(=O)NCc1ccc(cc1)C(F)(F)F