Reaction Details
TargetPeroxisome proliferator-activated receptor alpha
LigandBDBM50085043
Substrate/Competitorn/a
Meas. Tech.ChEMBL_88427 (CHEMBL700787)
EC50 740±n/a nM
Citation Willson, TMBrown, PJSternbach, DDHenke, BR The PPARs: from orphan receptors to drug discovery. J Med Chem43:527-50 (2000) Peroxisome proliferator-activated receptor alpha
Name:Peroxisome proliferator-activated receptor alpha
Type:Enzyme
Mol. Mass.:52222.08
Organism:Homo sapiens (Human)
Description:Q07869
Residue:468
BDBM50085043
NameBDBM50085043
Synonyms:3-{4-[2-(Benzooxazol-2-yl-methyl-amino)-ethoxy]-phenyl}-2-ethoxy-propionic acid CHEMBL306229 | SB-213068
TypeSmall organic molecule
Emp. Form.C21H24N2O5
Mol. Mass.384.4257
SMILESCCOC(Cc1ccc(OCCN(C)c2nc3ccccc3o2)cc1)C(O)=O