Reaction Details
TargetPeroxisome proliferator-activated receptor gamma
LigandBDBM50085042
Substrate/Competitorn/a
Meas. Tech.ChEMBL_88436 (CHEMBL701905)
EC50 300000±n/a nM
Citation Willson, TMBrown, PJSternbach, DDHenke, BR The PPARs: from orphan receptors to drug discovery. J Med Chem43:527-50 (2000) Peroxisome proliferator-activated receptor gamma
Name:Peroxisome proliferator-activated receptor gamma
Type:Nuclear Receptor
Mol. Mass.:57613.46
Organism:Homo sapiens (Human)
Description:P37231
Residue:505
BDBM50085042
NameBDBM50085042
Synonyms:2-(4-(4-Chlorobenzoyl)phenoxy)-2-methylpropanoic acid 1-methylethyl ester FENOFIBRATE Fenofibric acid Isopropyl (4'-(p-chlorobenzoyl)-2-phenoxy-2-methyl)propionate Lipantil (TN) Tricor (TN) | propan-2-yl 2-[4-(4-chlorobenzoyl)phenoxy]-2-methylpropanoate
TypeSmall organic molecule
Emp. Form.C20H21ClO4
Mol. Mass.360.831
SMILESCC(C)OC(=O)C(C)(C)Oc1ccc(cc1)C(=O)c1ccc(Cl)cc1