Reaction Details
TargetPeroxisome proliferator-activated receptor gamma
LigandBDBM50085046
Substrate/Competitorn/a
Meas. Tech.ChEMBL_139152 (CHEMBL747685)
EC50 1.2±n/a nM
Citation Willson, TMBrown, PJSternbach, DDHenke, BR The PPARs: from orphan receptors to drug discovery. J Med Chem43:527-50 (2000) Peroxisome proliferator-activated receptor gamma
Name:Peroxisome proliferator-activated receptor gamma
Type:PROTEIN
Mol. Mass.:57593.55
Organism:Mus musculus
Description:ChEMBL_1453700
Residue:505
BDBM50085046
NameBDBM50085046
Synonyms:2-((S)-1-carboxy-2-{4-[2-(5-methyl-2-phenyl-oxazol-4-yl)-ethoxy]-phenyl}-ethylamino)-benzoic acid methyl ester CHEMBL106666
TypeSmall organic molecule
Emp. Form.C29H28N2O6
Mol. Mass.500.5424
SMILESCOC(=O)c1ccccc1N[C@@H](Cc1ccc(OCCc2nc(oc2C)-c2ccccc2)cc1)C(O)=O