Reaction Details
TargetPeroxisome proliferator-activated receptor alpha
LigandBDBM50064455
Substrate/Competitorn/a
Meas. Tech.ChEMBL_139142 (CHEMBL743989)
EC50 4300±n/a nM
Citation Willson, TMBrown, PJSternbach, DDHenke, BR The PPARs: from orphan receptors to drug discovery. J Med Chem43:527-50 (2000) Peroxisome proliferator-activated receptor alpha
Name:Peroxisome proliferator-activated receptor alpha
Type:PROTEIN
Mol. Mass.:52343.28
Organism:Mus musculus
Description:ChEMBL_572395
Residue:468
BDBM50064455
NameBDBM50064455
Synonyms:4-{4-[2-(5-Methyl-2-phenyl-oxazol-4-yl)-ethoxy]-benzyl}-isoxazolidine-3,5-dione CHEMBL293526 | Reglitazar
TypeSmall organic molecule
Emp. Form.C22H20N2O5
Mol. Mass.392.4046
SMILESCc1oc(nc1CCOc1ccc(Cc2c(O)[nH]oc2=O)cc1)-c1ccccc1