Reaction Details
TargetPeroxisome proliferator-activated receptor alpha
LigandBDBM28662
Substrate/Competitorn/a
Meas. Tech.ChEMBL_139142 (CHEMBL743989)
EC50 270±n/a nM
Citation Willson, TMBrown, PJSternbach, DDHenke, BR The PPARs: from orphan receptors to drug discovery. J Med Chem43:527-50 (2000) Peroxisome proliferator-activated receptor alpha
Name:Peroxisome proliferator-activated receptor alpha
Type:PROTEIN
Mol. Mass.:52343.28
Organism:Mus musculus
Description:ChEMBL_572395
Residue:468
BDBM28662
NameBDBM28662
Synonyms:2-[4-(3-{[2-(2-chloro-6-fluorophenyl)ethyl][(2,3-dichlorophenyl)carbamoyl]amino}propyl)phenoxy]-2-methylpropanoic acid [3H]GW 2433
Typeradiolabeled ligand
Emp. Form.C28H28Cl3FN2O4
Mol. Mass.581.89
SMILESCC(C)(Oc1ccc(CCCN(CCc2c(F)cccc2Cl)C(=O)Nc2cccc(Cl)c2Cl)cc1)C(O)=O