Reaction Details
TargetPeroxisome proliferator-activated receptor alpha
LigandBDBM28799
Substrate/Competitorn/a
Meas. Tech.ChEMBL_88427 (CHEMBL700787)
EC50 50±n/a nM
Citation Willson, TMBrown, PJSternbach, DDHenke, BR The PPARs: from orphan receptors to drug discovery. J Med Chem43:527-50 (2000) Peroxisome proliferator-activated receptor alpha
Name:Peroxisome proliferator-activated receptor alpha
Type:Enzyme
Mol. Mass.:52222.08
Organism:Homo sapiens (Human)
Description:Q07869
Residue:468
BDBM28799
NameBDBM28799
Synonyms:2-{[4-(2-{[(2,4-difluorophenyl)carbamoyl](heptyl)amino}ethyl)phenyl]sulfanyl}-2-methylpropanoic acid GW 9578 GW9578
TypeSmall organic molecule
Emp. Form.C26H34F2N2O3S
Mol. Mass.492.622
SMILESCCCCCCCN(CCc1ccc(SC(C)(C)C(O)=O)cc1)C(=O)Nc1ccc(F)cc1F