Reaction Details
TargetPeroxisome proliferator-activated receptor gamma
LigandBDBM50085044
Substrate/Competitorn/a
Meas. Tech.ChEMBL_88436 (CHEMBL701905)
EC50 0.34±n/a nM
Citation Willson, TMBrown, PJSternbach, DDHenke, BR The PPARs: from orphan receptors to drug discovery. J Med Chem43:527-50 (2000) Peroxisome proliferator-activated receptor gamma
Name:Peroxisome proliferator-activated receptor gamma
Type:Nuclear Receptor
Mol. Mass.:57613.46
Organism:Homo sapiens (Human)
Description:P37231
Residue:505
BDBM50085044
NameBDBM50085044
Synonyms:(S)-2-(2-Benzoyl-phenylamino)-3-{4-[2-(5-methyl-2-phenyl-oxazol-4-yl)-ethoxy]-phenyl}-propionic acid 2-(2-BENZOYL-PHENYLAMINO)-3-{4-[2-(5-METHYL-2-PHENYL-OXAZOL-4-YL)-ETHOXY]-PHENYL}-PROPIONIC ACID CHEMBL107367 | Farglitazar
TypeSmall organic molecule
Emp. Form.C34H30N2O5
Mol. Mass.546.6124
SMILESCc1oc(nc1CCOc1ccc(C[C@H](Nc2ccccc2C(=O)c2ccccc2)C(O)=O)cc1)-c1ccccc1