Reaction Details
TargetPeroxisome proliferator-activated receptor gamma
LigandBDBM28662
Substrate/Competitorn/a
Meas. Tech.ChEMBL_88436 (CHEMBL701905)
EC50 2500±n/a nM
Citation Willson, TMBrown, PJSternbach, DDHenke, BR The PPARs: from orphan receptors to drug discovery. J Med Chem43:527-50 (2000) Peroxisome proliferator-activated receptor gamma
Name:Peroxisome proliferator-activated receptor gamma
Type:Nuclear Receptor
Mol. Mass.:57613.46
Organism:Homo sapiens (Human)
Description:P37231
Residue:505
BDBM28662
NameBDBM28662
Synonyms:2-[4-(3-{[2-(2-chloro-6-fluorophenyl)ethyl][(2,3-dichlorophenyl)carbamoyl]amino}propyl)phenoxy]-2-methylpropanoic acid [3H]GW 2433
Typeradiolabeled ligand
Emp. Form.C28H28Cl3FN2O4
Mol. Mass.581.89
SMILESCC(C)(Oc1ccc(CCCN(CCc2c(F)cccc2Cl)C(=O)Nc2cccc(Cl)c2Cl)cc1)C(O)=O