Reaction Details
TargetPeroxisome proliferator-activated receptor gamma
LigandBDBM24566
Substrate/Competitorn/a
Meas. Tech.ChEMBL_88436 (CHEMBL701905)
EC50 60000±n/a nM
Citation Willson, TMBrown, PJSternbach, DDHenke, BR The PPARs: from orphan receptors to drug discovery. J Med Chem43:527-50 (2000) Peroxisome proliferator-activated receptor gamma
Name:Peroxisome proliferator-activated receptor gamma
Type:Nuclear Receptor
Mol. Mass.:57613.46
Organism:Homo sapiens (Human)
Description:P37231
Residue:505
BDBM24566
NameBDBM24566
Synonyms:2-({4-chloro-6-[(2,3-dimethylphenyl)amino]pyrimidin-2-yl}sulfanyl)acetic acid JMC515449 Compound 1 Wyeth 14,643
TypeSmall organic molecule
Emp. Form.C14H14ClN3O2S
Mol. Mass.323.798
SMILESCc1cccc(Nc2cc(Cl)nc(SCC(O)=O)n2)c1C