Reaction Details
TargetPeroxisome proliferator-activated receptor gamma
LigandBDBM50064455
Substrate/Competitorn/a
Meas. Tech.ChEMBL_139152 (CHEMBL747685)
EC50 89±n/a nM
Citation Willson, TMBrown, PJSternbach, DDHenke, BR The PPARs: from orphan receptors to drug discovery. J Med Chem43:527-50 (2000) Peroxisome proliferator-activated receptor gamma
Name:Peroxisome proliferator-activated receptor gamma
Type:PROTEIN
Mol. Mass.:57593.55
Organism:Mus musculus
Description:ChEMBL_1453700
Residue:505
BDBM50064455
NameBDBM50064455
Synonyms:4-{4-[2-(5-Methyl-2-phenyl-oxazol-4-yl)-ethoxy]-benzyl}-isoxazolidine-3,5-dione CHEMBL293526 | Reglitazar
TypeSmall organic molecule
Emp. Form.C22H20N2O5
Mol. Mass.392.4046
SMILESCc1oc(nc1CCOc1ccc(Cc2c(O)[nH]oc2=O)cc1)-c1ccccc1