Reaction Details
TargetEstrogen receptor
LigandBDBM22435
Substrate/Competitorn/a
Meas. Tech.ChEMBL_1911363 (CHEMBL4413809)
IC50 2000±n/a nM
Citation Kim, JSong, JJi, HDYoo, EKLee, JELee, SBOh, JMLee, SHwang, JSYoon, HKim, DSLee, SJJeong, MLee, SKim, KHChoi, HSLee, SWPark, KGLee, IKKim, SHHwang, HJeon, YHChin, JCho, SJ Discovery of Potent, Selective, and Orally Bioavailable Estrogen-Related Receptor-? Inverse Agonists To Restore the Sodium Iodide Symporter Function in Anaplastic Thyroid Cancer. J Med Chem62:1837-1858 (2019) 
 
Estrogen receptor
Name:Estrogen receptor
Type:Protein
Mol. Mass.:66230.44
Organism:Homo sapiens (Human)
Description:P03372
Residue:595
BDBM22435
NameBDBM22435
Synonyms:4-[(1Z)-1-{4-[2-(dimethylamino)ethoxy]phenyl}-5-hydroxy-2-phenylpent-1-en-1-yl]phenol GSK 5182 US11285226, Compound GSK5182
TypeSmall organic molecule
Emp. Form.C27H31NO3
Mol. Mass.417.5399
SMILESCN(C)CCOc1ccc(cc1)C(=C(\CCCO)c1ccccc1)\c1ccc(O)cc1