Reaction Details
TargetPotassium voltage-gated channel subfamily H member 2
LigandBDBM22435
Substrate/Competitorn/a
Meas. Tech.ChEMBL_1911375 (CHEMBL4413821)
IC50>30000±n/a nM
Citation Kim, JSong, JJi, HDYoo, EKLee, JELee, SBOh, JMLee, SHwang, JSYoon, HKim, DSLee, SJJeong, MLee, SKim, KHChoi, HSLee, SWPark, KGLee, IKKim, SHHwang, HJeon, YHChin, JCho, SJ Discovery of Potent, Selective, and Orally Bioavailable Estrogen-Related Receptor-? Inverse Agonists To Restore the Sodium Iodide Symporter Function in Anaplastic Thyroid Cancer. J Med Chem62:1837-1858 (2019) 
 
Potassium voltage-gated channel subfamily H member 2
Name:Potassium voltage-gated channel subfamily H member 2
Type:Multi-pass membrane protein
Mol. Mass.:126672.65
Organism:Homo sapiens (Human)
Description:Q12809
Residue:1159
BDBM22435
NameBDBM22435
Synonyms:4-[(1Z)-1-{4-[2-(dimethylamino)ethoxy]phenyl}-5-hydroxy-2-phenylpent-1-en-1-yl]phenol GSK 5182 US11285226, Compound GSK5182
TypeSmall organic molecule
Emp. Form.C27H31NO3
Mol. Mass.417.5399
SMILESCN(C)CCOc1ccc(cc1)C(=C(\CCCO)c1ccccc1)\c1ccc(O)cc1