Reaction Details
TargetNeuronal acetylcholine receptor subunit alpha-3/beta-2
LigandBDBM50530216
Substrate/Competitorn/a
Meas. Tech.ChEMBL_1911486 (CHEMBL4413932)
EC50 430±n/a nM
Citation Manetti, DGarifulina, ABartolucci, GBazzicalupi, CBellucci, CChiaramonte, NDei, SDi Cesare Mannelli, LGhelardini, CGratteri, PSpirova, EShelukhina, ITeodori, EVarani, KTsetlin, VRomanelli, MN New Rigid Nicotine Analogues, Carrying a Norbornane Moiety, Are Potent Agonists of ?7 and ?3* Nicotinic Receptors. J Med Chem62:1887-1901 (2019) 
 
Neuronal acetylcholine receptor subunit alpha-3/beta-2
Name:Neuronal acetylcholine receptor subunit alpha-3/beta-2
Type:n/a
Mol. Mass.:n/a
Description:ASSAY_ID of EBI is 143246
Components:This complex has 2 components.
Component 1
Name:Neuronal acetylcholine receptor subunit beta-2
Synonyms:ACHB2_HUMAN Neuronal acetylcholine receptor protein beta-2 subunit | Nicotinic acetylcholine receptor alpha3/beta2/alpha5
Type:Protein
Mol. Mass.:57020.50
Organism:Homo sapiens (Human)
Description:P17787
Residue:502
Component 2
Name:Neuronal acetylcholine receptor subunit alpha-3
Synonyms:ACHA3_HUMAN Cholinergic, Nicotinic Alpha3Beta2 Cholinergic, Nicotinic Alpha3Beta4x NACHRA3 Neuronal acetylcholine receptor subunit alpha-3 nicotinic central
Type:Enzyme Catalytic Domain
Mol. Mass.:57479.03
Organism:Homo sapiens (Human)
Description:Cholinergic, Nicotinic Alpha3Beta2 0 HUMAN::P32297
Residue:505
BDBM50530216
NameBDBM50530216
Synonyms:CHEMBL4582201
TypeSmall organic molecule
Emp. Form.C12H15ClN2
Mol. Mass.222.714
SMILES[H][C@@]12CC[C@@]([H])(C1)[C@H]([C@@H]2N)c1ccc(Cl)nc1