Reaction Details
TargetB2 bradykinin receptor
LigandBDBM50085688
Substrate/Competitorn/a
Meas. Tech.ChEMBL_40443 (CHEMBL652382)
Ki>100000±n/a nM
Citation Dziadulewicz, EKRitchie, TJHallett, ASnell, CRKo, SYWrigglesworth, RHughes, GADunstan, ARBloomfield, GCDrake, GSBrown, MCLee, WBurgess, GMDavis, CYaqoob, MPerkins, MNCampbell, EADavis, AJRang, HP 1-(2-Nitrophenyl)thiosemicarbazides: a novel class of potent, orally active non-peptide antagonist for the bradykinin B(2) receptor. J Med Chem43:769-71 (2000) B2 bradykinin receptor
Name:B2 bradykinin receptor
Type:Enzyme Catalytic Domain
Mol. Mass.:44941.22
Organism:RAT
Description:B2 BRADYKININ BDKRB2 RAT::P25023
Residue:396
BDBM50085688
NameBDBM50085688
Synonyms:CHEMBL164914 | benzylamino-3-nitrobenzylhydrazinemethanethione
TypeSmall organic molecule
Emp. Form.C14H14N4O2S
Mol. Mass.302.352
SMILES[O-][N+](=O)c1cccc(N[N-]C(=[SH+])NCc2ccccc2)c1