Reaction Details
TargetB2 bradykinin receptor
LigandBDBM50409120
Substrate/Competitorn/a
Meas. Tech.ChEMBL_40443 (CHEMBL652382)
Ki 0.5±n/a nM
Citation Dziadulewicz, EKRitchie, TJHallett, ASnell, CRKo, SYWrigglesworth, RHughes, GADunstan, ARBloomfield, GCDrake, GSBrown, MCLee, WBurgess, GMDavis, CYaqoob, MPerkins, MNCampbell, EADavis, AJRang, HP 1-(2-Nitrophenyl)thiosemicarbazides: a novel class of potent, orally active non-peptide antagonist for the bradykinin B(2) receptor. J Med Chem43:769-71 (2000) B2 bradykinin receptor
Name:B2 bradykinin receptor
Type:Enzyme Catalytic Domain
Mol. Mass.:44941.22
Organism:RAT
Description:B2 BRADYKININ BDKRB2 RAT::P25023
Residue:396
BDBM50409120
NameBDBM50409120
Synonyms:CHEMBL2112044 | CHEMBL2112937
TypeSmall organic molecule
Emp. Form.C32H42N8O5S2
Mol. Mass.682.856
SMILESCN(C)CCN(C)CCNC(=O)C1CCCN1S(=O)(=O)c1ccc(NN\C([S-])=[NH+]\C(c2ccccc2)c2ccccc2)c(c1)[N+]([O-])=O