Reaction Details
TargetGrowth factor receptor-bound protein 2
LigandBDBM50073909
Substrate/Competitorn/a
Meas. Tech.ChEMBL_72360 (CHEMBL686597)
IC50 4±n/a nM
Citation Gao, YLuo, JYao, ZJGuo, RZou, HKelley, JVoigt, JHYang, DBurke, TR Inhibition of Grb2 SH2 domain binding by non-phosphate-containing ligands. 2. 4-(2-Malonyl)phenylalanine as a potent phosphotyrosyl mimetic. J Med Chem43:911-20 (2000) Growth factor receptor-bound protein 2
Name:Growth factor receptor-bound protein 2
Type:Protein
Mol. Mass.:25205.04
Organism:Homo sapiens (Human)
Description:P62993
Residue:217
BDBM50073909
NameBDBM50073909
Synonyms:CHEMBL72036 {4-[2-Acetylamino-2-(1-{2-carbamoyl-1-[3-(5-methyl-indol-1-yl)-propylcarbamoyl]-ethylcarbamoyl}-cyclohexylcarbamoyl)-ethyl]-benzyl}-phosphonic acid
TypeSmall organic molecule
Emp. Form.C35H47N6O8P
Mol. Mass.710.7568
SMILESCC(=O)N[C@@H](Cc1ccc(CP(O)(O)=O)cc1)C(=O)NC1(CCCCC1)C(=O)N[C@@H](CC(N)=O)C(=O)NCCCn1ccc2cc(C)ccc12