Reaction Details
TargetDelta-type opioid receptor
LigandBDBM50086367
Substrate/Competitorn/a
Meas. Tech.ChEBML_145496
Ki 176±n/a nM
Citation Allen, MPBlake, JFBryce, DKHaggan, MELiras, SMcLean, SSegelstein, BE Design, synthesis and biological evaluation of 3-amino-3-phenylpropionamide derivatives as novel mu opioid receptor ligands. Bioorg Med Chem Lett10:523-6 (2000) Delta-type opioid receptor
Name:Delta-type opioid receptor
Type:G Protein-Coupled Receptor (GPCR)
Mol. Mass.:40382.98
Organism:Homo sapiens (Human)
Description:Competition binding assays were carried out using membrane preparations from transfected HN9.10 cells that constitutively expressed the delta opioid receptor.
Residue:372
BDBM50086367
NameBDBM50086367
Synonyms:3-(3-Hydroxy-phenyl)-2,2-dimethyl-3-methylamino-N-phenethyl-propionamide | CHEMBL149280
TypeSmall organic molecule
Emp. Form.C20H26N2O2
Mol. Mass.326.4326
SMILESCNC(c1cccc(O)c1)C(C)(C)C(=O)NCCc1ccccc1