Reaction Details
TargetKappa-type opioid receptor
LigandBDBM50086365
Substrate/Competitorn/a
Meas. Tech.ChEBML_145264
Ki 75±n/a nM
Citation Allen, MPBlake, JFBryce, DKHaggan, MELiras, SMcLean, SSegelstein, BE Design, synthesis and biological evaluation of 3-amino-3-phenylpropionamide derivatives as novel mu opioid receptor ligands. Bioorg Med Chem Lett10:523-6 (2000) Kappa-type opioid receptor
Name:Kappa-type opioid receptor
Type:G Protein-Coupled Receptor (GPCR)
Mol. Mass.:42648.76
Organism:Homo sapiens (Human)
Description:P41145
Residue:380
BDBM50086365
NameBDBM50086365
Synonyms:3-(Butyl-methyl-amino)-3-(3-hydroxy-phenyl)-2,2-dimethyl-N-phenethyl-propionamide | CHEMBL150839
TypeSmall organic molecule
Emp. Form.C24H34N2O2
Mol. Mass.382.539
SMILESCCCCN(C)C(c1cccc(O)c1)C(C)(C)C(=O)NCCc1ccccc1