Reaction Details
TargetPhosphatidylinositol 4,5-bisphosphate 3-kinase catalytic subunit alpha isoform
LigandBDBM50403068
Substrate/Competitorn/a
Meas. Tech.ChEMBL_1914101 (CHEMBL4416684)
IC50 10000±n/a nM
Citation Barnes, LBlaber, HBrooks, DTKByers, LBuckley, DByron, ZCChilvers, RGCochrane, LCooney, EDamian, HAFrancis, LFu He, DGrace, JMJGreen, HJHogarth, EJPJusu, LKillalea, CEKing, OLambert, JLee, ZJLima, NSLong, CLMackinnon, MLMahdy, SMatthews-Wright, JMillward, MJMeehan, MFMerrett, CMorrison, LParke, HRIPayne, CPayne, LPike, CSeal, ASenior, AJSmith, KMStanelyte, KStillibrand, JSzpara, RTaday, FFHThreadgould, AMTrainor, RJWaters, JWilliams, OWong, CKWWood, KBarton, NGruszka, AHenley, ZRowedder, JECookson, RJones, KLNadin, ASmith, IEMacdonald, SJFNortcliffe, A Free-Wilson Analysis of Comprehensive Data on Phosphoinositide-3-kinase (PI3K) Inhibitors Reveals Importance of  J Med Chem62:10402-10422 (2019) 
 
Phosphatidylinositol 4,5-bisphosphate 3-kinase catalytic subunit alpha isoform
Name:Phosphatidylinositol 4,5-bisphosphate 3-kinase catalytic subunit alpha isoform
Type:Enzyme Subunit
Mol. Mass.:124294.87
Organism:Homo sapiens (Human)
Description:P42336
Residue:1068
BDBM50403068
NameBDBM50403068
Synonyms:CHEMBL2216870 US9745321, CAL-101
TypeSmall organic molecule
Emp. Form.C22H18FN7O
Mol. Mass.415.423
SMILESCC[C@H](Nc1ncnc2nc[nH]c12)c1nc2cccc(F)c2c(=O)n1-c1ccccc1