Reaction Details
TargetThymidylate synthase
LigandBDBM50088161
Substrate/Competitorn/a
Meas. Tech.ChEMBL_209985 (CHEMBL821413)
Ki 0.42±n/a nM
Citation Bavetsias, VMarriott, JHMelin, CKimbell, RMatusiak, ZSBoyle, FTJackman, AL Design and synthesis of Cyclopenta[g]quinazoline-based antifolates as inhibitors of thymidylate synthase and potential antitumor agents(,). J Med Chem43:1910-26 (2000) Thymidylate synthase
Name:Thymidylate synthase
Type:PROTEIN
Mol. Mass.:34957.15
Organism:Mus musculus
Description:ChEMBL_1340097
Residue:307
BDBM50088161
NameBDBM50088161
Synonyms:2-(4-Carboxy-4-{4-[(2-methyl-4-oxo-4,6,7,8-tetrahydro-3H-cyclopenta[g]quinazolin-6-yl)-prop-2-ynyl-amino]-benzoylamino}-butyrylamino)-pentanedioic acid | CHEMBL293148
TypeSmall organic molecule
Emp. Form.C32H33N5O9
Mol. Mass.631.6325
SMILESCc1nc2cc3CCC(N(CC#C)c4ccc(cc4)C(=O)N[C@@H](CCC(=O)N[C@H](CCC(O)=O)C(O)=O)C(O)=O)c3cc2c(=O)[nH]1