Reaction Details
TargetDual specificity protein kinase TTK
LigandBDBM50512456
Substrate/Competitorn/a
Meas. Tech.ChEMBL_1924421 (CHEMBL4427377)
Ki 0.100000±n/a nM
Citation Liu, YLaufer, RPatel, NKNg, GSampson, PBLi, SWLang, YFeher, MBrokx, RBeletskaya, IHodgson, RPlotnikova, OAwrey, DEQiu, WChirgadze, NYMason, JMWei, XLin, DCChe, YKiarash, RFletcher, GCMak, TWBray, MRPauls, HW Discovery of Pyrazolo[1,5-a]pyrimidine TTK Inhibitors: CFI-402257 is a Potent, Selective, Bioavailable Anticancer Agent. ACS Med Chem Lett7:671-5 (2016) 
 
Dual specificity protein kinase TTK
Name:Dual specificity protein kinase TTK
Type:Protein
Mol. Mass.:97086.79
Organism:Homo sapiens (Human)
Description:P33981
Residue:857
BDBM50512456
NameBDBM50512456
Synonyms:CHEMBL4469414
TypeSmall organic molecule
Emp. Form.C28H30N6O3
Mol. Mass.498.5762
SMILESCc1cc(ccc1C(=O)NC1CC1)-c1cnn2c(NC[C@H]3C[C@@](C)(O)C3)cc(Oc3cccnc3)nc12