Reaction Details
TargetPlasminogen
LigandBDBM50088982
Substrate/Competitorn/a
Meas. Tech.ChEBML_155082
IC50 367±n/a nM
Citation Tamura, SYWeinhouse, MIRoberts, CAGoldman, EAMasukawa, KAnderson, SMCohen, CRBradbury, AEBernardino, VTDixon, SAMa, MGNolan, TGBrunck, TK Synthesis and biological activity of peptidyl aldehyde urokinase inhibitors. Bioorg Med Chem Lett10:983-7 (2000) Plasminogen
Name:Plasminogen
Type:Enzyme
Mol. Mass.:90579.18
Organism:Homo sapiens (Human)
Description:n/a
Residue:810
BDBM50088982
NameBDBM50088982
Synonyms:CHEMBL160253 N-[1-(1-Carbamimidoyl-2-hydroxy-piperidin-3-ylcarbamoyl)-ethyl]-3-hydroxy-2-(2-phenyl-ethanesulfonylamino)-propionamide; TFA
TypeSmall organic molecule
Emp. Form.C20H32N6O6S
Mol. Mass.484.57
SMILESC[C@H](NC(=O)[C@@H](CO)NS(=O)(=O)CCc1ccccc1)C(=O)N[C@H]1CCCN(C1O)C(N)=N