Reaction Details
TargetProstaglandin G/H synthase 1
LigandBDBM50089125
Substrate/Competitorn/a
Meas. Tech.ChEBML_159407
IC50>100000±n/a nM
Citation Revesz, LDi Padova, FEBuhl, TFeifel, RGram, HHiestand, PManning, UZimmerlin, AG SAR of 4-hydroxypiperidine and hydroxyalkyl substituted heterocycles as novel p38 map kinase inhibitors. Bioorg Med Chem Lett10:1261-4 (2000) Prostaglandin G/H synthase 1
Name:Prostaglandin G/H synthase 1
Type:Protein
Mol. Mass.:68868.60
Organism:Ovis aries (Sheep)
Description:n/a
Residue:600
BDBM50089125
NameBDBM50089125
Synonyms:4-[4-(4-Fluoro-phenyl)-5-pyridin-4-yl-1H-imidazol-2-yl]-1-methyl-piperidin-4-ol | CHEMBL281145
TypeSmall organic molecule
Emp. Form.C20H21FN4O
Mol. Mass.352.4053
SMILESCN1CCC(O)(CC1)c1nc(c([nH]1)-c1ccc(F)cc1)-c1ccncc1