Reaction Details
TargetProstaglandin G/H synthase 1
LigandBDBM50089130
Substrate/Competitorn/a
Meas. Tech.ChEBML_159407
IC50 6300±n/a nM
Citation Revesz, LDi Padova, FEBuhl, TFeifel, RGram, HHiestand, PManning, UZimmerlin, AG SAR of 4-hydroxypiperidine and hydroxyalkyl substituted heterocycles as novel p38 map kinase inhibitors. Bioorg Med Chem Lett10:1261-4 (2000) Prostaglandin G/H synthase 1
Name:Prostaglandin G/H synthase 1
Type:Protein
Mol. Mass.:68868.60
Organism:Ovis aries (Sheep)
Description:n/a
Residue:600
BDBM50089130
NameBDBM50089130
Synonyms:1-[5-(4-Fluoro-phenyl)-4-pyridin-4-yl-1H-imidazol-2-yl]-cyclohexanol | CHEMBL25219
TypeSmall organic molecule
Emp. Form.C20H20FN3O
Mol. Mass.337.3907
SMILESOC1(CCCCC1)c1nc(c([nH]1)-c1ccc(F)cc1)-c1ccncc1