Reaction Details
TargetMitogen-activated protein kinase 14
LigandBDBM50089123
Substrate/Competitorn/a
Meas. Tech.ChEBML_221156
IC50 80±n/a nM
Citation Revesz, LDi Padova, FEBuhl, TFeifel, RGram, HHiestand, PManning, UZimmerlin, AG SAR of 4-hydroxypiperidine and hydroxyalkyl substituted heterocycles as novel p38 map kinase inhibitors. Bioorg Med Chem Lett10:1261-4 (2000) Mitogen-activated protein kinase 14
Name:Mitogen-activated protein kinase 14
Type:Enzyme
Mol. Mass.:41281.22
Organism:Mus musculus (mouse)
Description:The full-length open reading frame of murine p38 alpha was cloned and expressed in E. coli.. Soluble murine p38R was extracted from cell pellets and purified using ion-exchange chromatography.
Residue:360
BDBM50089123
NameBDBM50089123
Synonyms:1-[5-(4-Fluoro-phenyl)-4-pyridin-4-yl-1H-imidazol-2-yl]-cyclopentanol | CHEMBL23828
TypeSmall organic molecule
Emp. Form.C19H18FN3O
Mol. Mass.323.3641
SMILESOC1(CCCC1)c1nc(c([nH]1)-c1ccc(F)cc1)-c1ccncc1