Reaction Details
TargetMitogen-activated protein kinase 14
LigandBDBM50089126
Substrate/Competitorn/a
Meas. Tech.ChEBML_221156
IC50 350±n/a nM
Citation Revesz, LDi Padova, FEBuhl, TFeifel, RGram, HHiestand, PManning, UZimmerlin, AG SAR of 4-hydroxypiperidine and hydroxyalkyl substituted heterocycles as novel p38 map kinase inhibitors. Bioorg Med Chem Lett10:1261-4 (2000) Mitogen-activated protein kinase 14
Name:Mitogen-activated protein kinase 14
Type:Enzyme
Mol. Mass.:41281.22
Organism:Mus musculus (mouse)
Description:The full-length open reading frame of murine p38 alpha was cloned and expressed in E. coli.. Soluble murine p38R was extracted from cell pellets and purified using ion-exchange chromatography.
Residue:360
BDBM50089126
NameBDBM50089126
Synonyms:4-[4-(4-Fluoro-phenyl)-5-pyridin-4-yl-oxazol-2-yl]-1-methyl-piperidin-4-ol | CHEMBL22978
TypeSmall organic molecule
Emp. Form.C20H20FN3O2
Mol. Mass.353.3901
SMILESCN1CCC(O)(CC1)c1nc(c(o1)-c1ccncc1)-c1ccc(F)cc1