Reaction Details
TargetMitogen-activated protein kinase 14
LigandBDBM50089130
Substrate/Competitorn/a
Meas. Tech.ChEBML_221156
IC50 120±n/a nM
Citation Revesz, LDi Padova, FEBuhl, TFeifel, RGram, HHiestand, PManning, UZimmerlin, AG SAR of 4-hydroxypiperidine and hydroxyalkyl substituted heterocycles as novel p38 map kinase inhibitors. Bioorg Med Chem Lett10:1261-4 (2000) Mitogen-activated protein kinase 14
Name:Mitogen-activated protein kinase 14
Type:Enzyme
Mol. Mass.:41281.22
Organism:Mus musculus (mouse)
Description:The full-length open reading frame of murine p38 alpha was cloned and expressed in E. coli.. Soluble murine p38R was extracted from cell pellets and purified using ion-exchange chromatography.
Residue:360
BDBM50089130
NameBDBM50089130
Synonyms:1-[5-(4-Fluoro-phenyl)-4-pyridin-4-yl-1H-imidazol-2-yl]-cyclohexanol | CHEMBL25219
TypeSmall organic molecule
Emp. Form.C20H20FN3O
Mol. Mass.337.3907
SMILESOC1(CCCCC1)c1nc(c([nH]1)-c1ccc(F)cc1)-c1ccncc1