Reaction Details
TargetDelta-type opioid receptor
LigandBDBM50089153
Substrate/Competitorn/a
Meas. Tech.ChEBML_147046
Ki 3.3±n/a nM
Citation Thomas, JBAtkinson, RNRothman, RBBurgess, JPMascarella, SWDersch, CMXu, HCarroll, FI 4-[(8-Alkyl-8-azabicyclo[3.2.1]octyl-3-yl)-3-arylanilino]-N,N-diethylbenzamides: high affinity, selective ligands for the delta opioid receptor illustrate factors important to antagonist activity. Bioorg Med Chem Lett10:1281-4 (2000) Delta-type opioid receptor
Name:Delta-type opioid receptor
Type:G Protein-Coupled Receptor (GPCR)
Mol. Mass.:40465.04
Organism:Rattus norvegicus (rat)
Description:Competition binding assays were using CHO-K1 cell membranes expressing the opioid receptor.
Residue:372
BDBM50089153
NameBDBM50089153
Synonyms:4-[(8-Allyl-8-aza-bicyclo[3.2.1]oct-3-yl)-(3-methoxy-phenyl)-amino]-N,N-diethyl-benzamide | CHEMBL3085004
TypeSmall organic molecule
Emp. Form.C28H37N3O2
Mol. Mass.447.6123
SMILES[H][C@]12CC[C@]([H])(C[C@@H](C1)N(c1ccc(cc1)C(=O)N(CC)CC)c1cccc(OC)c1)N2CC=C