Reaction Details
TargetKappa-type opioid receptor
LigandBDBM50000780
Substrate/Competitorn/a
Meas. Tech.ChEMBL_1926744 (CHEMBL4429816)
EC50 17±n/a nM
Citation Váradi, AMarrone, GFPalmer, TCNarayan, ASzabó, MRLe Rouzic, VGrinnell, SGSubrath, JJWarner, EKalra, SHunkele, APagirsky, JEans, SOMedina, JMXu, JPan, YXBorics, APasternak, GWMcLaughlin, JPMajumdar, S Mitragynine/Corynantheidine Pseudoindoxyls As Opioid Analgesics with Mu Agonism and Delta Antagonism, Which Do Not Recruit ?-Arrestin-2. J Med Chem59:8381-97 (2016) 
 
Kappa-type opioid receptor
Name:Kappa-type opioid receptor
Type:Enzyme
Mol. Mass.:42656.78
Organism:Mus musculus (Mouse)
Description:P33534
Residue:380
BDBM50000780
NameBDBM50000780
Synonyms:2-(3,4-Dichloro-phenyl)-N-methyl-N-(2-pyrrolidin-1-yl-cyclohexyl)-acetamide CHEMBL593781
TypeSmall organic molecule
Emp. Form.C19H26Cl2N2O
Mol. Mass.369.329
SMILESCN([C@H]1CCCC[C@@H]1N1CCCC1)C(=O)Cc1ccc(Cl)c(Cl)c1