Reaction Details
TargetFatty acid-binding protein, liver
LigandBDBM8961
Substrate/Competitorn/a
Meas. Tech.ChEMBL_1929092 (CHEMBL4432268)
Kd 900000±n/a nM
Citation Hendrick, AGMüller, IWillems, HLeonard, PMIrving, SDavenport, RIto, TReeves, JWright, SAllen, VWilkinson, SHeffron, HBazin, RTurney, JMitchell, PJ Identification and Investigation of Novel Binding Fragments in the Fatty Acid Binding Protein 6 (FABP6). J Med Chem59:8094-102 (2016) 
 
Fatty acid-binding protein, liver
Name:Fatty acid-binding protein, liver
Type:Protein
Mol. Mass.:14208.72
Organism:Homo sapiens (Human)
Description:human L-FABP
Residue:127
BDBM8961
NameBDBM8961
Synonyms:1,2,3,4-tetrahydro-9-acridinamine 9-THA CHEMBL1337960 Cognex Tracine cid_1935 | tacrine.HCl
TypeSmall organic molecule
Emp. Form.C13H14N2
Mol. Mass.198.2637
SMILESNc1c2CCCCc2nc2ccccc12