Reaction Details
TargetGastrotropin
LigandBDBM8961
Substrate/Competitorn/a
Meas. Tech.ChEMBL_1929090 (CHEMBL4432266)
Kd 200000±n/a nM
Citation Hendrick, AGMüller, IWillems, HLeonard, PMIrving, SDavenport, RIto, TReeves, JWright, SAllen, VWilkinson, SHeffron, HBazin, RTurney, JMitchell, PJ Identification and Investigation of Novel Binding Fragments in the Fatty Acid Binding Protein 6 (FABP6). J Med Chem59:8094-102 (2016) 
 
Gastrotropin
Name:Gastrotropin
Type:PROTEIN
Mol. Mass.:14371.59
Organism:Homo sapiens
Description:ChEMBL_118985
Residue:128
BDBM8961
NameBDBM8961
Synonyms:1,2,3,4-tetrahydro-9-acridinamine 9-THA CHEMBL1337960 Cognex Tracine cid_1935 | tacrine.HCl
TypeSmall organic molecule
Emp. Form.C13H14N2
Mol. Mass.198.2637
SMILESNc1c2CCCCc2nc2ccccc12