Reaction Details
TargetHistamine H3 receptor
LigandBDBM50091385
Substrate/Competitorn/a
Meas. Tech.ChEMBL_86898 (CHEMBL698408)
Ki 0.26±n/a nM
Citation Sasse, ASadek, BLigneau, XElz, SPertz, HHLuger, PGanellin, CRArrang, JMSchwartz, JCSchunack, WStark, H New histamine H(3)-receptor ligands of the proxifan series: imoproxifan and other selective antagonists with high oral in vivo potency. J Med Chem43:3335-43 (2000) Histamine H3 receptor
Name:Histamine H3 receptor
Type:G Protein-Coupled Receptor (GPCR)
Mol. Mass.:48607.98
Organism:Rattus norvegicus (rat)
Description:n/a
Residue:445
BDBM50091385
NameBDBM50091385
Synonyms:1-{4-[3-(1H-Imidazol-4-yl)-propoxy]-phenyl}-ethanone oxime; compound with but-2-enedioic acid (0.5 M H2O) | CHEMBL114085
TypeSmall organic molecule
Emp. Form.C14H17N3O2
Mol. Mass.259.3037
SMILESCC(N=O)c1ccc(OCCCc2cnc[nH]2)cc1