Reaction Details
TargetC-C chemokine receptor type 2
LigandBDBM50091441
Substrate/Competitorn/a
Meas. Tech.ChEBML_41896
Ki 1600±n/a nM
Citation Forbes, ITCooper, DGDodds, EKHickey, DMIfe, RJMeeson, MStockley, MBerkhout, TAGohil, JGroot, PHMoores, K CCR2B receptor antagonists: conversion of a weak HTS hit to a potent lead compound. Bioorg Med Chem Lett10:1803-6 (2000) C-C chemokine receptor type 2
Name:C-C chemokine receptor type 2
Type:Enzyme
Mol. Mass.:41932.32
Organism:Homo sapiens (Human)
Description:P41597
Residue:374
BDBM50091441
NameBDBM50091441
Synonyms:1-(3,4-Dichloro-phenyl)-3-{5-[4-(1H-indol-3-yl)-piperidin-1-yl]-pentyl}-urea CHEMBL300025 | TCMDC-139117
TypeSmall organic molecule
Emp. Form.C25H30Cl2N4O
Mol. Mass.473.438
SMILESClc1ccc(NC(=O)NCCCCCN2CCC(CC2)c2c[nH]c3ccccc23)cc1Cl