Reaction Details
TargetC-C chemokine receptor type 2
LigandBDBM50091447
Substrate/Competitorn/a
Meas. Tech.ChEBML_41896
Ki 1700±n/a nM
Citation Forbes, ITCooper, DGDodds, EKHickey, DMIfe, RJMeeson, MStockley, MBerkhout, TAGohil, JGroot, PHMoores, K CCR2B receptor antagonists: conversion of a weak HTS hit to a potent lead compound. Bioorg Med Chem Lett10:1803-6 (2000) C-C chemokine receptor type 2
Name:C-C chemokine receptor type 2
Type:Enzyme
Mol. Mass.:41932.32
Organism:Homo sapiens (Human)
Description:P41597
Residue:374
BDBM50091447
NameBDBM50091447
Synonyms:(E)-3-(4-tert-Butyl-phenyl)-N-{5-[4-(1H-indol-3-yl)-piperidin-1-yl]-pentyl}-acrylamide TCMDC-139247
TypeSmall organic molecule
Emp. Form.C31H41N3O
Mol. Mass.471.6767
SMILESCC(C)(C)c1ccc(\C=C\C(=O)NCCCCCN2CCC(CC2)c2c[nH]c3ccccc23)cc1