Reaction Details
TargetC-C chemokine receptor type 2
LigandBDBM50091451
Substrate/Competitorn/a
Meas. Tech.ChEBML_41896
Ki 360±n/a nM
Citation Forbes, ITCooper, DGDodds, EKHickey, DMIfe, RJMeeson, MStockley, MBerkhout, TAGohil, JGroot, PHMoores, K CCR2B receptor antagonists: conversion of a weak HTS hit to a potent lead compound. Bioorg Med Chem Lett10:1803-6 (2000) C-C chemokine receptor type 2
Name:C-C chemokine receptor type 2
Type:Enzyme
Mol. Mass.:41932.32
Organism:Homo sapiens (Human)
Description:P41597
Residue:374
BDBM50091451
NameBDBM50091451
Synonyms:(E)-3-(3,4-Dichloro-phenyl)-N-{5-[4-(6-hydroxy-1H-indol-3-yl)-piperidin-1-yl]-pentyl}-acrylamide TCMDC-139282
TypeSmall organic molecule
Emp. Form.C27H31Cl2N3O2
Mol. Mass.500.46
SMILESOc1ccc2c(c[nH]c2c1)C1CCN(CCCCCNC(=O)\C=C\c2ccc(Cl)c(Cl)c2)CC1