Reaction Details
TargetC-C chemokine receptor type 2
LigandBDBM50091463
Substrate/Competitorn/a
Meas. Tech.ChEBML_41896
Ki>10000±n/a nM
Citation Forbes, ITCooper, DGDodds, EKHickey, DMIfe, RJMeeson, MStockley, MBerkhout, TAGohil, JGroot, PHMoores, K CCR2B receptor antagonists: conversion of a weak HTS hit to a potent lead compound. Bioorg Med Chem Lett10:1803-6 (2000) C-C chemokine receptor type 2
Name:C-C chemokine receptor type 2
Type:Enzyme
Mol. Mass.:41932.32
Organism:Homo sapiens (Human)
Description:P41597
Residue:374
BDBM50091463
NameBDBM50091463
Synonyms:3,4-Dichloro-N-{5-[4-(1H-indol-3-yl)-piperidin-1-yl]-pentyl}-benzenesulfonamide | CHEMBL300868
TypeSmall organic molecule
Emp. Form.C24H29Cl2N3O2S
Mol. Mass.494.477
SMILESClc1ccc(cc1Cl)S(=O)(=O)NCCCCCN1CCC(CC1)c1c[nH]c2ccccc12