Reaction Details
TargetNeuropeptide Y receptor type 1
LigandBDBM50091679
Substrate/Competitorn/a
Meas. Tech.ChEMBL_143674 (CHEMBL755163)
IC50 110±n/a nM
Citation Balasubramaniam, ATao, ZZhai, WStein, MSheriff, SChance, WTFischer, JEEden, PETaylor, JELiu, CDMcFadden, DWVoisin, TRoze, CLaburthe, M Structure-activity studies including a Psi(CH(2)-NH) scan of peptide YY (PYY) active site, PYY(22-36), for interaction with rat intestinal PYY receptors: development of analogues with potent in vivo activity in the intestine. J Med Chem43:3420-7 (2000) Neuropeptide Y receptor type 1
Name:Neuropeptide Y receptor type 1
Type:Enzyme Catalytic Domain
Mol. Mass.:44399.07
Organism:Homo sapiens (Human)
Description:NPY-Y1 NPY1R HUMAN::P25929
Residue:384
BDBM50091679
NameBDBM50091679
Synonyms:CHEMBL441007 | bis(24/24'){N-alpha-Ac-[Cys24]PYY(22-36)-NH2}bis(24/24'){N-alpha-Ac-ASCAHYLNLVTRQRY-NH2}
TypeSmall organic molecule
Emp. Form.C166H264N58O44S2
Mol. Mass.3840.365
SMILESCC(C)C[C@H](NC(=O)[C@H](Cc1ccc(O)cc1)NC(=O)[C@H](Cc1cnc[nH]1)NC(=O)[C@H](CCCNC(N)=N)NC(=O)[C@@H](CSSC[C@H](NC(=O)[C@H](CO)NC(=O)[C@H](C)NC(C)=O)C(=O)N[C@@H](CCCNC(N)=N)C(=O)N[C@@H](Cc1cnc[nH]1)C(=O)N[C@@H](Cc1ccc(O)cc1)C(=O)N[C@@H](CC(C)C)C(=O)N[C@@H](CC(N)=O)C(=O)N[C@@H](CC(C)C)C(=O)N[C@@H](C(C)C)C(=O)N[C@@H]([C@@H](C)O)C(=O)N[C@@H](CCCNC(N)=N)C(=O)N[C@@H](CCC(N)=O)C(=O)N[C@@H](CCCNC(N)=N)C(=O)N[C@@H](Cc1ccc(O)cc1)C(N)=O)NC(=O)[C@H](CO)NC(=O)[C@H](C)NC(C)=O)C(=O)N[C@@H](CC(N)=O)C(=O)N[C@@H](CC(C)C)C(=O)N[C@@H](C(C)C)C(=O)N[C@@H]([C@@H](C)O)C(=O)N[C@@H](CCCNC(N)=N)C(=O)N[C@@H](CCC(N)=O)C(=O)N[C@@H](CCCNC(N)=N)C(=O)N[C@@H](Cc1ccc(O)cc1)C(N)=O