Reaction Details
TargetNitric oxide synthase, inducible
LigandBDBM50063300
Substrate/Competitorn/a
Meas. Tech.ChEBML_89191
IC50 1400±n/a nM
Citation Hagmann, WKCaldwell, CGChen, PDurette, PLEsser, CKLanza, TJKopka, IEGuthikonda, RShah, SKMacCoss, MChabin, RMFletcher, DGrant, SKGreen, BGHumes, JLKelly, TMLuell, SMeurer, RMoore, VPacholok, SGPavia, TWilliams, HRWong, KK Substituted 2-aminopyridines as inhibitors of nitric oxide synthases. Bioorg Med Chem Lett10:1975-8 (2001) Nitric oxide synthase, inducible
Name:Nitric oxide synthase, inducible
Type:Homodimer
Mol. Mass.:131141.95
Organism:Homo sapiens (Human)
Description:P35228
Residue:1153
BDBM50063300
NameBDBM50063300
Synonyms:(L-N6-1-iminoethyl)lysine 6-Acetimidoylamino-2-amino-hexanoic acid CHEMBL7889 N~6~-[(1Z)-ethanimidoyl]-L-lysine | l-NIL
TypeSmall organic molecule
Emp. Form.C8H17N3O2
Mol. Mass.187.2395
SMILESCC(N)=NCCCC[C@H](N)C(O)=O