Reaction Details
TargetMitogen-activated protein kinase 14
LigandBDBM50091927
Substrate/Competitorn/a
Meas. Tech.ChEBML_124644
IC50 2±n/a nM
Citation Dumas, JSibley, RRiedl, BMonahan, MKLee, WLowinger, TBRedman, AMJohnson, JSKingery-Wood, JScott, WJSmith, RABobko, MSchoenleber, RRanges, GEHousley, TJBhargava, AWilhelm, SMShrikhande, A Discovery of a new class of p38 kinase inhibitors. Bioorg Med Chem Lett10:2047-50 (2000) Mitogen-activated protein kinase 14
Name:Mitogen-activated protein kinase 14
Type:Serine/threonine-protein kinase
Mol. Mass.:41286.76
Organism:Homo sapiens (Human)
Description:Q16539
Residue:360
BDBM50091927
NameBDBM50091927
Synonyms:1-(2,6-Dichloro-phenyl)-1-(4'-fluoro-6-hydroxymethyl-2'-methyl-biphenyl-3-yl)-urea | CHEMBL62794
TypeSmall organic molecule
Emp. Form.C21H17Cl2FN2O2
Mol. Mass.419.276
SMILESCc1cc(F)ccc1-c1cc(ccc1CO)N(C(N)=O)c1c(Cl)cccc1Cl