Reaction Details
TargetBeta-2 adrenergic receptor
LigandBDBM50092027
Substrate/Competitorn/a
Meas. Tech.ChEBML_38301
IC50 620±n/a nM
Citation Brockunier, LLParmee, EROk, HOCandelore, MRCascieri, MAColwell, LFDeng, LFeeney, WPForrest, MJHom, GJMacIntyre, DETota, LWyvratt, MJFisher, MHWeber, AE Human beta3-adrenergic receptor agonists containing 1,2,3-triazole-substituted benzenesulfonamides. Bioorg Med Chem Lett10:2111-4 (2000) Beta-2 adrenergic receptor
Name:Beta-2 adrenergic receptor
Type:n/a
Mol. Mass.:46461.69
Organism:Homo sapiens (Human)
Description:P07550
Residue:413
BDBM50092027
NameBDBM50092027
Synonyms:CHEMBL63825 | N-{4-[2-((R)-2-Hydroxy-2-pyridin-3-yl-ethylamino)-ethyl]-phenyl}-4-[4-(4-trifluoromethoxy-phenoxymethyl)-[1,2,3]triazol-2-yl]-benzenesulfonamide
TypeSmall organic molecule
Emp. Form.C31H29F3N6O5S
Mol. Mass.654.659
SMILESO[C@@H](CNCCc1ccc(NS(=O)(=O)c2ccc(cc2)-n2ncc(COc3ccc(OC(F)(F)F)cc3)n2)cc1)c1cccnc1