Reaction Details
TargetBeta-3 adrenergic receptor
LigandBDBM50092019
Substrate/Competitorn/a
Meas. Tech.ChEBML_41696
EC50 48±n/a nM
Citation Brockunier, LLParmee, EROk, HOCandelore, MRCascieri, MAColwell, LFDeng, LFeeney, WPForrest, MJHom, GJMacIntyre, DETota, LWyvratt, MJFisher, MHWeber, AE Human beta3-adrenergic receptor agonists containing 1,2,3-triazole-substituted benzenesulfonamides. Bioorg Med Chem Lett10:2111-4 (2000) Beta-3 adrenergic receptor
Name:Beta-3 adrenergic receptor
Type:G Protein-Coupled Receptor (GPCR)
Mol. Mass.:43534.88
Organism:Homo sapiens (Human)
Description:n/a
Residue:408
BDBM50092019
NameBDBM50092019
Synonyms:CHEMBL67404 | N-{4-[2-((R)-2-Hydroxy-2-pyridin-3-yl-ethylamino)-ethyl]-phenyl}-4-[4-(2,4,6-trifluoro-benzyl)-[1,2,3]triazol-2-yl]-benzenesulfonamide
TypeSmall organic molecule
Emp. Form.C30H27F3N6O3S
Mol. Mass.608.634
SMILESO[C@@H](CNCCc1ccc(NS(=O)(=O)c2ccc(cc2)-n2ncc(Cc3c(F)cc(F)cc3F)n2)cc1)c1cccnc1