Reaction Details
TargetBeta-3 adrenergic receptor
LigandBDBM50092034
Substrate/Competitorn/a
Meas. Tech.ChEBML_41696
EC50 24±n/a nM
Citation Brockunier, LLParmee, EROk, HOCandelore, MRCascieri, MAColwell, LFDeng, LFeeney, WPForrest, MJHom, GJMacIntyre, DETota, LWyvratt, MJFisher, MHWeber, AE Human beta3-adrenergic receptor agonists containing 1,2,3-triazole-substituted benzenesulfonamides. Bioorg Med Chem Lett10:2111-4 (2000) Beta-3 adrenergic receptor
Name:Beta-3 adrenergic receptor
Type:G Protein-Coupled Receptor (GPCR)
Mol. Mass.:43534.88
Organism:Homo sapiens (Human)
Description:n/a
Residue:408
BDBM50092034
NameBDBM50092034
Synonyms:4-[4-(2,6-Difluoro-benzyl)-[1,2,3]triazol-2-yl]-N-{4-[2-((R)-2-hydroxy-2-pyridin-3-yl-ethylamino)-ethyl]-phenyl}-benzenesulfonamide | CHEMBL66789
TypeSmall organic molecule
Emp. Form.C30H28F2N6O3S
Mol. Mass.590.644
SMILESO[C@@H](CNCCc1ccc(NS(=O)(=O)c2ccc(cc2)-n2ncc(Cc3c(F)cccc3F)n2)cc1)c1cccnc1